BDBM105167 US10047086, 69::US10640503, Example 69::US9695168, 69
SMILES COc1ncc(cc1N)-c1c(cc(OC[C@@H]2CCCN(C)C2)c2cncn12)-c1ccc(cc1)C#N
InChI Key InChIKey=KGEUYBDSIBFVRE-LJQANCHMSA-N
Data  3 IC50
  Tab Delimited (TSV)   2D SDfile   Computed 3D by Vconf -m prep SDfile
Find this compound or compounds like it in BindingDB:
Activity Spreadsheet -- Enzyme Inhibition Constant Data from BindingDB
Found 3 hits for monomerid = 105167
TargetLysine-specific histone demethylase 1A [151-852](Homo sapiens (Human))
Incyte
US Patent
LigandPNGBDBM105167(US10047086, 69 | US10640503, Example 69 | US969516...)
Affinity DataIC50:  75nMpH: 7.5 T: 2°C. Assay description: LANCE LSD1/KDM1A demethylase assay¿10 uL of 1 nM LSD-1 enzyme (ENZO BML-SE544-0050) in the assay buffer (50 mM Tris, pH 7.5, 0.01% Tween-20, 25 mM Na...
In DepthDetails US Patent
TargetLysine-specific histone demethylase 1A(Homo sapiens (Human))
Incyte
US Patent
LigandPNGBDBM105167(US10047086, 69 | US10640503, Example 69 | US969516...)
Affinity DataIC50:  75nM. Assay description: LANCE LSD1/KDM1A demethylase assay-10 μL of 1 nM LSD-1 enzyme (ENZO BML-SE544-0050) in the assay buffer (50 mM Tris, pH 7.5, 0.01% Tween-20, 25 ...
In DepthDetails US Patent
TargetLysine-specific histone demethylase 1A(Homo sapiens (Human))
Incyte
US Patent
LigandPNGBDBM105167(US10047086, 69 | US10640503, Example 69 | US969516...)
Affinity DataIC50:  75nMpH: 7.5Assay Description:LANCE LSD1/KDM1A demethylase assay-10 μL of 1 nM LSD-1 enzyme (ENZO BML-SE544-0050) in the assay buffer (50 mM Tris, pH 7.5, 0.01% Tween-20, 25 ...
In DepthDetails US Patent