BDBM105368 US8575203, I-125.10
SMILES CC(c1ccc(F)c(F)c1)n1cccc(C(=O)NCC#Cc2ccc3nccc(OC[C@H]4CCN(C)C4)c3c2)c1=O
InChI Key InChIKey=BKPAUUSCLLOPKJ-YANBTOMASA-N
Data  1 IC50
  Tab Delimited (TSV)   2D SDfile   Computed 3D by Vconf -m prep SDfile
Find this compound or compounds like it in BindingDB:
Activity Spreadsheet -- Enzyme Inhibition Constant Data from BindingDB
Found 1 hit for monomerid = 105368
Target3-phosphoinositide-dependent protein kinase 1(Homo sapiens (Human))
Boehringer Ingelheim International
US Patent
LigandPNGBDBM105368(US8575203, I-125.10)
Affinity DataIC50:  3nM. Assay description: The activity of the compounds according to the invention on the kinase PDK1 which inhibits the signal transduction pathway is determined in an in vit...
In DepthDetails US Patent