BDBM10567 (3S)-3-[(5-bromopyridin-3-yl)formamido]-5-{[(4-fluorophenyl)methyl]sulfanyl}-4-oxopentanoic acid::nicotinyl aspartyl ketone 17
SMILES OC(=O)C[C@H](NC(=O)c1cncc(Br)c1)C(=O)CSCc1ccc(F)cc1
InChI Key InChIKey=BEZANDXSEWBNME-HNNXBMFYSA-N
Data  1 IC50
  Tab Delimited (TSV)   2D SDfile   Computed 3D by Vconf -m prep SDfile
Find this compound or compounds like it in BindingDB:
Activity Spreadsheet -- Enzyme Inhibition Constant Data from BindingDB
Found 1 hit for monomerid = 10567
TargetCaspase-3(Homo sapiens (Human))
Merck Frosst Canada
LigandPNGBDBM10567((3S)-3-[(5-bromopyridin-3-yl)formamido]-5-{[(4-flu...)
Affinity DataIC50:  1.20E+3nMpH: 7.0 T: 2°C. Assay description: The substrate peptides terminating in AMC are processed by caspases with or without inhibitors, and the accumulation of AMC was assessed with a Cytof...
In DepthDetails ArticlePubMed