BDBM106070 US10047086, 153::US10640503, Example 153::US9695168, 153
SMILES CN1CCC[C@@H](COc2cc(-c3ccc(cc3)C#N)c(-c3ccc4n(C)c(C)nc4c3)n3cncc23)C1
InChI Key InChIKey=UDRCAPMASRKPRL-JOCHJYFZSA-N
Data  3 IC50
  Tab Delimited (TSV)   2D SDfile   Computed 3D by Vconf -m prep SDfile
Find this compound or compounds like it in BindingDB:
Activity Spreadsheet -- Enzyme Inhibition Constant Data from BindingDB
Found 3 hits for monomerid = 106070
TargetLysine-specific histone demethylase 1A [151-852](Homo sapiens (Human))
Incyte
US Patent
LigandPNGBDBM106070(US10047086, 153 | US10640503, Example 153 | US9695...)
Affinity DataIC50: <50nMpH: 7.5 T: 2°C. Assay description: LANCE LSD1/KDM1A demethylase assay¿10 uL of 1 nM LSD-1 enzyme (ENZO BML-SE544-0050) in the assay buffer (50 mM Tris, pH 7.5, 0.01% Tween-20, 25 mM Na...
In DepthDetails US Patent
TargetLysine-specific histone demethylase 1A(Homo sapiens (Human))
Incyte
US Patent
LigandPNGBDBM106070(US10047086, 153 | US10640503, Example 153 | US9695...)
Affinity DataIC50: <50nM. Assay description: LANCE LSD1/KDM1A demethylase assay-10 μL of 1 nM LSD-1 enzyme (ENZO BML-SE544-0050) in the assay buffer (50 mM Tris, pH 7.5, 0.01% Tween-20, 25 ...
In DepthDetails US Patent
TargetLysine-specific histone demethylase 1A(Homo sapiens (Human))
Incyte
US Patent
LigandPNGBDBM106070(US10047086, 153 | US10640503, Example 153 | US9695...)
Affinity DataIC50: <50nMpH: 7.5Assay Description:LANCE LSD1/KDM1A demethylase assay-10 μL of 1 nM LSD-1 enzyme (ENZO BML-SE544-0050) in the assay buffer (50 mM Tris, pH 7.5, 0.01% Tween-20, 25 ...
In DepthDetails US Patent