BDBM106175 US8575197, II-088
SMILES CC(C)c1[nH]nc2C(=O)N(C(c12)c1ccccc1NS(C)(=O)=O)c1ccc(cc1)-c1ccsc1
InChI Key InChIKey=YJRUZNCQTSGJNQ-UHFFFAOYSA-N
Data  1 IC50
  Tab Delimited (TSV)   2D SDfile   Computed 3D by Vconf -m prep SDfile
Find this compound or compounds like it in BindingDB:
Activity Spreadsheet -- Enzyme Inhibition Constant Data from BindingDB
Found 1 hit for monomerid = 106175
TargetP2X purinoceptor 3(Homo sapiens (Human))
Shionogi
US Patent
LigandPNGBDBM106175(US8575197, II-088)
Affinity DataIC50:  4nM. Assay description: Inhibition assay using human P2X3 receptor gene (GeneBank accession number Y07683).
In DepthDetails US Patent