BDBM106569 CHEMBL2206403::US8586617, 1
SMILES CCN(Cc1cnc[nH]1)c1ccccc1
InChI Key InChIKey=ZAOIDGNRHJWXTG-UHFFFAOYSA-N
Data  2 KI
  Tab Delimited (TSV)   2D SDfile   Computed 3D by Vconf -m prep SDfile
Find this compound or compounds like it in BindingDB:
Activity Spreadsheet -- Enzyme Inhibition Constant Data from BindingDB
Found 2 hits for monomerid = 106569
TargetTrace amine-associated receptor 1(Mus musculus (Mouse))
Hoffmann-La Roche
US Patent
LigandPNGBDBM106569(CHEMBL2206403 | US8586617, 1)
Affinity DataKi:  6.10nM ΔG°:  -10.4kcal/moleT: 2°C. Assay description: Radioligand binding assay: The radioligand [3H]-rac-2-(1,2,3,4-tetrahydro-1-naphthyl)-2-imidazoline was used at a concentration equal to the calcula...
In DepthDetails US Patent
TargetTrace amine-associated receptor 1(Homo sapiens (Human))
F. Hoffmann-La Roche
Curated by ChEMBL
LigandPNGBDBM106569(CHEMBL2206403 | US8586617, 1)
Affinity DataKi:  48nM. Assay description: Displacement of (S)-4-(2,4-difluorophenyl-3-tritio) -4,5-dihydro-2-oxazolamine from human TAAR1 receptor expressed in HEK293 cells after 90 mins by b...
In DepthDetails ArticlePubMed