BDBM106686 US8586571, 20
SMILES CC(C)(C)c1ccccc1S(=O)(=O)C1CN(C1)C(=O)c1ccccc1
InChI Key InChIKey=CQWQQLVBUREWGV-UHFFFAOYSA-N
Data  1 IC50
  Tab Delimited (TSV)   2D SDfile   Computed 3D by Vconf -m prep SDfile
Find this compound or compounds like it in BindingDB:
Activity Spreadsheet -- Enzyme Inhibition Constant Data from BindingDB
Found 1 hit for monomerid = 106686
TargetRetinol-binding protein 4(Homo sapiens (Human))
Takeda Pharmaceutical
US Patent
LigandPNGBDBM106686(US8586571, 20)
Affinity DataIC50:  290nM. Assay description: The action of the compound of the present invention to inhibit binding of RBP4 and retinol and TTR was evaluated using the Retinol-RBP4-TTR ELISA (hu...
Ligand InfoPC cidPC sid
In DepthDetails US Patent