BDBM106694 US8586571, 207
SMILES CC(C)(C)c1cc(Cl)ccc1OCC1CN(C1)C(=O)C(O)=O
InChI Key InChIKey=HSZKIGUXCRPTEG-UHFFFAOYSA-N
Data  1 IC50
  Tab Delimited (TSV)   2D SDfile   Computed 3D by Vconf -m prep SDfile
Find this compound or compounds like it in BindingDB:
Activity Spreadsheet -- Enzyme Inhibition Constant Data from BindingDB
Found 1 hit for monomerid = 106694
TargetRetinol-binding protein 4(Homo sapiens (Human))
Takeda Pharmaceutical
US Patent
LigandPNGBDBM106694(US8586571, 207)
Affinity DataIC50:  12nM. Assay description: The action of the compound of the present invention to inhibit binding of RBP4 and retinol and TTR was evaluated using the Retinol-RBP4-TTR ELISA (hu...
Ligand InfoPC cidPC sid
In DepthDetails US Patent