BDBM106783 7‐(benzyloxy)‐3‐(4‐methoxyphenyl)‐4H‐chromen‐4‐one::7-Benzyl-4′-methoxy-isoflavone (3d)
SMILES COc1ccc(cc1)-c1coc2cc(OCc3ccccc3)ccc2c1=O
InChI Key InChIKey=ZMJWASOKXZNAGI-UHFFFAOYSA-N
Data  2 IC50
  Tab Delimited (TSV)   2D SDfile   Computed 3D by Vconf -m prep SDfile
Find this compound or compounds like it in BindingDB:
Activity Spreadsheet -- Enzyme Inhibition Constant Data from BindingDB
Found 2 hits for monomerid = 106783
TargetPolyunsaturated fatty acid lipoxygenase ALOX15(Homo sapiens (Human))
Universidad De Santiago De Chile
LigandPNGBDBM106783(7‐(benzyloxy)‐3‐(4‐methoxy...)
Affinity DataIC50: >1.00E+5nMpH: 7.5 T: 2°C. Assay description: All reactions were carried in a volume of 2 mL stirred at 23°C with approximately 2.040 Units of 12-hLOX, 4.200 Units of 15-hLOX-1, and 6.600 Un...
In DepthDetails ArticlePubMed
TargetPolyunsaturated fatty acid lipoxygenase ALOX12(Homo sapiens (Human))
Universidad De Santiago De Chile
LigandPNGBDBM106783(7‐(benzyloxy)‐3‐(4‐methoxy...)
Affinity DataIC50: >1.00E+5nMpH: 8.0 T: 2°C. Assay description: All reactions were carried in a volume of 2 mL stirred at 23°C with approximately 2.040 Units of 12-hLOX, 4.200 Units of 15-hLOX-1, and 6.600 Un...
In DepthDetails ArticlePubMed