BDBM106978 US8592454, 176
SMILES CN([C@@H]1CN(C[C@H]1c1ccc(F)cc1)C(=O)C1CCN(CC1)C(C)=O)C(=O)N(C)c1cc(Cl)cc(Cl)c1
InChI Key InChIKey=MVWDYFOJQAABRA-LOSJGSFVSA-N
Data  3 IC50
  Tab Delimited (TSV)   2D SDfile   Computed 3D by Vconf -m prep SDfile
Find this compound or compounds like it in BindingDB:
Activity Spreadsheet -- Enzyme Inhibition Constant Data from BindingDB
Found 3 hits for monomerid = 106978
TargetSubstance-P receptor(Homo sapiens (Human))
Takeda Pharmaceutical
US Patent
LigandPNGBDBM106978(US8592454, 176)
Affinity DataIC50:  0.0290nM. Assay description: Radioligand receptor binding inhibitory assay using human NK receptor.
In DepthDetails US Patent
TargetNeuromedin-K receptor(Homo sapiens (Human))
Takeda Pharmaceutical
US Patent
LigandPNGBDBM106978(US8592454, 176)
Affinity DataIC50:  600nM. Assay description: Radioligand receptor binding inhibitory assay using human NK receptor.
In DepthDetails US Patent
TargetSubstance-K receptor(Homo sapiens (Human))
Takeda Pharmaceutical
US Patent
LigandPNGBDBM106978(US8592454, 176)
Affinity DataIC50:  12nM. Assay description: Radioligand receptor binding inhibitory assay using human NK receptor.
In DepthDetails US Patent