BDBM107101 US8592371, 3
SMILES N[C@H]1C[C@H](CO[C@@H]1c1cc(F)ccc1F)N1Cc2cnn(c2C1)S(=O)(=O)C1CCCC1
InChI Key InChIKey=HQRVCZSAVCSZFT-AJYIIGQXSA-N
Data  1 IC50
  Tab Delimited (TSV)   2D SDfile   Computed 3D by Vconf -m prep SDfile
Find this compound or compounds like it in BindingDB:
Activity Spreadsheet -- Enzyme Inhibition Constant Data from BindingDB
Found 1 hit for monomerid = 107101
TargetDipeptidyl peptidase 4(Homo sapiens (Human))
Merck Sharpe & Dohme
US Patent
LigandPNGBDBM107101(US8592371, 3)
Affinity DataIC50:  2.60nM. Assay description: Enzyme assay using dipeptidyl peptidase-IV.
In DepthDetails US Patent