BDBM107153 US8592426, 2
SMILES FC(F)COc1c(Cl)cc(Cl)cc1-c1ccc2C(CCc2c1)NC(=O)C1(CC1)NC(=O)C(F)(F)F
InChI Key InChIKey=CHXHGDPPQTWZQN-UHFFFAOYSA-N
Data  1 KI  1 IC50
  Tab Delimited (TSV)   2D SDfile   Computed 3D by Vconf -m prep SDfile
Find this compound or compounds like it in BindingDB:
Activity Spreadsheet -- Enzyme Inhibition Constant Data from BindingDB
Found 2 hits for monomerid = 107153
TargetKininogen-1(Homo sapiens (Human))
Hoffmann-La Roche
US Patent
LigandPNGBDBM107153(US8592426, 2)
Affinity DataKi:  146nM. Assay description: Binding assay using Bradykinin-1 receptor.
In DepthDetails US Patent
TargetKininogen-1(Homo sapiens (Human))
Hoffmann-La Roche
US Patent
LigandPNGBDBM107153(US8592426, 2)
Affinity DataIC50:  76.8nM. Assay description: Calcium mobilization assay using Bradykinin-1 receptor.
In DepthDetails US Patent