BDBM107157 US8592426, 6
SMILES COC(=O)c1c(Cl)cccc1-c1ccc2[C@H](CCc2c1)NC(=O)C1(COC1)NC(=O)C(F)(F)F
InChI Key InChIKey=MTFMCHRVVYXNMF-KRWDZBQOSA-N
Data  1 KI  1 IC50
  Tab Delimited (TSV)   2D SDfile   Computed 3D by Vconf -m prep SDfile
Find this compound or compounds like it in BindingDB:
Activity Spreadsheet -- Enzyme Inhibition Constant Data from BindingDB
Found 2 hits for monomerid = 107157
TargetKininogen-1(Homo sapiens (Human))
Hoffmann-La Roche
US Patent
LigandPNGBDBM107157(US8592426, 6)
Affinity DataKi:  381nM. Assay description: Binding assay using Bradykinin-1 receptor.
In DepthDetails US Patent
TargetKininogen-1(Homo sapiens (Human))
Hoffmann-La Roche
US Patent
LigandPNGBDBM107157(US8592426, 6)
Affinity DataIC50:  455nM. Assay description: Calcium mobilization assay using Bradykinin-1 receptor.
In DepthDetails US Patent