BDBM107214 US8592426, 65
SMILES COc1cc(on1)C(=O)NC1(CC1)C(=O)NC1CSc2cc(ccc12)-c1cc(Cl)cc(F)c1-c1nnn(C)n1
InChI Key InChIKey=HOONOQPHTXFQCK-UHFFFAOYSA-N
Data  1 KI  1 IC50
  Tab Delimited (TSV)   2D SDfile   Computed 3D by Vconf -m prep SDfile
Find this compound or compounds like it in BindingDB:
Activity Spreadsheet -- Enzyme Inhibition Constant Data from BindingDB
Found 2 hits for monomerid = 107214
TargetKininogen-1(Homo sapiens (Human))
Hoffmann-La Roche
US Patent
LigandPNGBDBM107214(US8592426, 65)
Affinity DataKi:  4.40nM. Assay description: Binding assay using Bradykinin-1 receptor.
In DepthDetails US Patent
TargetKininogen-1(Homo sapiens (Human))
Hoffmann-La Roche
US Patent
LigandPNGBDBM107214(US8592426, 65)
Affinity DataIC50:  0.200nM. Assay description: Calcium mobilization assay using Bradykinin-1 receptor.
In DepthDetails US Patent