BDBM107375 US8592431, 183
SMILES CCCc1c(Cc2ccc(cc2)-c2ccccc2-c2nc(=O)o[nH]2)c(=O)n([C@H]2CC[C@@](C)(CC2)OCCO)c2ncnn12
InChI Key InChIKey=NTRGXZDLTZWXKK-FVQXVRMNSA-N
Data  1 IC50
  Tab Delimited (TSV)   2D SDfile   Computed 3D by Vconf -m prep SDfile
Find this compound or compounds like it in BindingDB:
Activity Spreadsheet -- Enzyme Inhibition Constant Data from BindingDB
Found 1 hit for monomerid = 107375
TargetAcetyl-coenzyme A transporter 1(Homo sapiens (Human))
Takeda Pharmaceutical
US Patent
LigandPNGBDBM107375(US8592431, 183)
Affinity DataIC50:  2.5nMpH: 7.4Assay Description:The binding assay was performed using 22.5 pM [125I]-angiotensin II [manufactured by PerkinElmer, USA] (9 μg) in the presence of AT1 membrane an...
In DepthDetails US Patent