BDBM107797 US8598155, 34
SMILES Cc1nc(-c2cnn(C)c2-c2ccc(Cl)cc2F)c2c(ncnn12)N1CCC1
InChI Key InChIKey=VCDUPFPCYAYAPL-UHFFFAOYSA-N
Data  1 IC50
  Tab Delimited (TSV)   2D SDfile   Computed 3D by Vconf -m prep SDfile
Find this compound or compounds like it in BindingDB:
Activity Spreadsheet -- Enzyme Inhibition Constant Data from BindingDB
Found 1 hit for monomerid = 107797
TargetcGMP-dependent 3',5'-cyclic phosphodiesterase(Homo sapiens (Human))
Pfizer
US Patent
LigandPNGBDBM107797(US8598155, 34)
Affinity DataIC50:  1nM. Assay description: The activity of the test substances on human full-length PDE2A3 enzyme was determined using the [3H]-cGMP scintillation proximity assay (SPA) modifie...
In DepthDetails US Patent