BDBM10789 3-(but-3-yn-2-ylamino)-2,3-dihydro-1H-inden-5-yl N,N-dimethylcarbamate::Aminoindan deriv. 26a
SMILES CC(NC1CCc2ccc(OC(=O)N(C)C)cc12)C#C
InChI Key InChIKey=YEXUALQIKTXJCT-UHFFFAOYSA-N
Data  4 IC50
  Tab Delimited (TSV)   2D SDfile   Computed 3D by Vconf -m prep SDfile
Find this compound or compounds like it in BindingDB:
Activity Spreadsheet -- Enzyme Inhibition Constant Data from BindingDB
Found 4 hits for monomerid = 10789
TargetAcetylcholinesterase(Homo sapiens (Human))
Teva Pharmaceutical Industries
LigandPNGBDBM10789(3-(but-3-yn-2-ylamino)-2,3-dihydro-1H-inden-5-yl N...)
Affinity DataIC50:  1.80E+3nM. Assay description: The cholinesterase assays were performed using colorimetric method reported by Ellman. The absorbance changes at 412 nm were recorded for 5 min with ...
In DepthDetails ArticlePubMed
TargetAmine oxidase [flavin-containing] B(Rattus norvegicus (rat))
Teva Pharmaceutical Industries
LigandPNGBDBM10789(3-(but-3-yn-2-ylamino)-2,3-dihydro-1H-inden-5-yl N...)
Affinity DataIC50: >1.00E+6nM. Assay description: Inhibition of MAO activity was determined by a radiometric procedure from Tipton and Youdim. Homogenized rat brain was used as the source of enzymes....
In DepthDetails ArticlePubMed
TargetAmine oxidase [flavin-containing] A(Rattus norvegicus (rat))
Teva Pharmaceutical Industries
LigandPNGBDBM10789(3-(but-3-yn-2-ylamino)-2,3-dihydro-1H-inden-5-yl N...)
Affinity DataIC50: >1.00E+6nM. Assay description: Inhibition of MAO activity was determined by a radiometric procedure from Tipton and Youdim. Homogenized rat brain was used as the source of enzymes....
In DepthDetails ArticlePubMed
TargetCarboxylic ester hydrolase(Equus caballus (Horse))
Teva Pharmaceutical Industries
LigandPNGBDBM10789(3-(but-3-yn-2-ylamino)-2,3-dihydro-1H-inden-5-yl N...)
Affinity DataIC50:  2.34E+3nM. Assay description: The cholinesterase assays were performed using colorimetric method reported by Ellman. The absorbance changes at 412 nm were recorded for 5 min with ...
In DepthDetails ArticlePubMed