BDBM108069 3‐amino‐1‐[(3Z)‐2‐oxo‐1H‐indol‐3‐ylidene]thiourea (Compound 9)
SMILES NNC(=S)N=C1C(=O)Nc2ccccc12
InChI Key InChIKey=HYRQWDQFFWMKJJ-UHFFFAOYSA-N
Data  1 IC50
  Tab Delimited (TSV)   2D SDfile   Computed 3D by Vconf -m prep SDfile
Find this compound or compounds like it in BindingDB:
Activity Spreadsheet -- Enzyme Inhibition Constant Data from BindingDB
Found 1 hit for monomerid = 108069
TargetSecreted chorismate mutase(Mycobacterium tuberculosis H37Rv)
Birla Institute Of Technology
LigandPNGBDBM108069(3‐amino‐1‐[(3Z)‐2‐ox...)
Affinity DataIC50:  6.69E+4nMT: 2°C. Assay description: The reaction was initiated by the addition of 150pmoles of enzyme to a mixture of inhibitor (40µM, 20 µM, 10 µM, 5 µM, 1 µM ...
Ligand InfoPC cidPC sid
In DepthDetails ArticlePubMed