BDBM108208 US8598157, I-85
SMILES COc1ncc(cc1NS(=O)(=O)c1ccc(Cl)s1)C#Cc1c(C)ncnc1N1CCOCC1
InChI Key InChIKey=MWXFUTSDPZBPAJ-UHFFFAOYSA-N
Data  1 IC50
  Tab Delimited (TSV)   2D SDfile   Computed 3D by Vconf -m prep SDfile
Find this compound or compounds like it in BindingDB:
Activity Spreadsheet -- Enzyme Inhibition Constant Data from BindingDB
Found 1 hit for monomerid = 108208
TargetPhosphatidylinositol 4,5-bisphosphate 3-kinase catalytic subunit alpha isoform(Homo sapiens (Human))
Boehringer Ingelheim International
US Patent
LigandPNGBDBM108208(US8598157, I-85)
Affinity DataIC50:  0.380nMT: 2°C. Assay description: This PI3Kalpha assay provides an IC50 value indicative of the activity of the compounds to inhibit PI3 kinase alpha activity. Inhibition of PI3 kinas...
In DepthDetails US Patent