BDBM108265 US8604046, 45
SMILES C[C@H]1CCCN1[C@H]1CCN(C1)c1ccc(N2CCC3(CCNCC3)C2=O)c(C)c1
InChI Key InChIKey=FWDIGXJMBTVNDB-FPOVZHCZSA-N
Data  1 KI
  Tab Delimited (TSV)   2D SDfile   Computed 3D by Vconf -m prep SDfile
Find this compound or compounds like it in BindingDB:
Activity Spreadsheet -- Enzyme Inhibition Constant Data from BindingDB
Found 1 hit for monomerid = 108265
TargetHistamine H3 receptor(Macaca mulatta (Rhesus macaque))
Sanofi
US Patent
LigandPNGBDBM108265(US8604046, 45)
Affinity DataKi:  11nM. Assay description: The compounds of this invention have been demonstrated to displace [3H]- methylhistamine radioligand binding to mammalian cell membranes expressing r...
In DepthDetails US Patent