BDBM108354 US9695200, 85
SMILES CC(=C)C(=O)Nc1cccc(c1)-c1cnc2[nH]cc(-c3cccnc3)c2c1
InChI Key InChIKey=JXFWAHVORGGQRA-UHFFFAOYSA-N
Data  2 IC50
  Tab Delimited (TSV)   2D SDfile   Computed 3D by Vconf -m prep SDfile
Find this compound or compounds like it in BindingDB:
Activity Spreadsheet -- Enzyme Inhibition Constant Data from BindingDB
Found 2 hits for monomerid = 108354
Target1-phosphatidylinositol 4,5-bisphosphate phosphodiesterase gamma-1(Homo sapiens (Human))
Confluence Life Sciences
US Patent
LigandPNGBDBM108354(US9695200, 85)
Affinity DataIC50: >5.00E+3nMT: 2°C. Assay description: Compounds were serially diluted into DMSO, and then into media to concentrations 10× that of the final assay concentration. Compounds were then added...
Ligand InfoPC cidPC sid
In DepthDetails US Patent
TargetTyrosine-protein kinase ITK/TSK(Homo sapiens (Human))
Confluence Life Sciences
US Patent
LigandPNGBDBM108354(US9695200, 85)
Affinity DataIC50: <1.00E+3nM. Assay description: This assay is based on the binding of a proprietary, Alexa Fluor 647-labeled, ATP-competitive kinase inhibitor (kinase tracer-236) to the ITK express...
Ligand InfoPC cidPC sid
In DepthDetails US Patent