BDBM108362 US8604217, 28
SMILES Brc1c(Br)c(Br)c2[nH]c(Nc3ccncc3)nc2c1Br
InChI Key InChIKey=QJIZZSLYWRJKQT-UHFFFAOYSA-N
Data  1 IC50
  Tab Delimited (TSV)   2D SDfile   Computed 3D by Vconf -m prep SDfile
Find this compound or compounds like it in BindingDB:
Activity Spreadsheet -- Enzyme Inhibition Constant Data from BindingDB
Found 1 hit for monomerid = 108362
TargetSerine/threonine-protein kinase pim-1(Homo sapiens (Human))
Selvita
US Patent
LigandPNGBDBM108362(US8604217, 28)
Affinity DataIC50:  37.0nMpH: 7.0Assay Description:Kinase assay was performed using luminescent Kinase-Glo (Promega) system. The Kinase-Glo Luminescent Kinase Assay Platform provides a homogeneous, hi...
In DepthDetails US Patent