BDBM108386 US8604217, 261
SMILES Brc1c(Br)c(Br)c2[nH]c(NC3CCCCCCC3)nc2c1Br
InChI Key InChIKey=UJFIPGNFAOHMBS-UHFFFAOYSA-N
Data  1 IC50
  Tab Delimited (TSV)   2D SDfile   Computed 3D by Vconf -m prep SDfile
Find this compound or compounds like it in BindingDB:
Activity Spreadsheet -- Enzyme Inhibition Constant Data from BindingDB
Found 1 hit for monomerid = 108386
TargetSerine/threonine-protein kinase pim-1(Homo sapiens (Human))
Selvita
US Patent
LigandPNGBDBM108386(US8604217, 261)
Affinity DataIC50:  138nMpH: 7.0Assay Description:Kinase assay was performed using luminescent Kinase-Glo (Promega) system. The Kinase-Glo Luminescent Kinase Assay Platform provides a homogeneous, hi...
In DepthDetails US Patent