BDBM108392 US8604217, 304cis
SMILES NC1CCCCC1Nc1nc2c(Br)c(Br)c(Br)c(Br)c2[nH]1
InChI Key InChIKey=YUANQCCFWPCCDL-UHFFFAOYSA-N
Data  1 IC50
  Tab Delimited (TSV)   2D SDfile   Computed 3D by Vconf -m prep SDfile
Find this compound or compounds like it in BindingDB:
Activity Spreadsheet -- Enzyme Inhibition Constant Data from BindingDB
Found 1 hit for monomerid = 108392
TargetSerine/threonine-protein kinase pim-1(Homo sapiens (Human))
Selvita
US Patent
LigandPNGBDBM108392(US8604217, 304cis)
Affinity DataIC50:  6.90nMpH: 7.0Assay Description:Kinase assay was performed using luminescent Kinase-Glo (Promega) system. The Kinase-Glo Luminescent Kinase Assay Platform provides a homogeneous, hi...
In DepthDetails US Patent