BDBM108539 US8604016, 102::US9938267, Cmpd ID 102
SMILES Fc1cccc(CC(=O)Nc2nnc(CCSCCc3nnc(NC(=O)Cc4cccc(F)c4)s3)s2)c1
InChI Key InChIKey=IBXIDWDLAFWKCE-UHFFFAOYSA-N
Data  2 IC50
  Tab Delimited (TSV)   2D SDfile   Computed 3D by Vconf -m prep SDfile
Find this compound or compounds like it in BindingDB:
Activity Spreadsheet -- Enzyme Inhibition Constant Data from BindingDB
Found 2 hits for monomerid = 108539
TargetGlutaminase kidney isoform, mitochondrial(Homo sapiens (Human))
Calithera Biosciences
US Patent
LigandPNGBDBM108539(US8604016, 102 | US9938267, Cmpd ID 102)
Affinity DataIC50:  240nM. Assay description: No preinc (Column 4).
In DepthDetails US Patent
TargetGlutaminase kidney isoform, mitochondrial(Homo sapiens (Human))
Calithera Biosciences
US Patent
LigandPNGBDBM108539(US8604016, 102 | US9938267, Cmpd ID 102)
Affinity DataIC50:  240nM. Assay description: Compounds were assessed for their ability to inhibit the enzymatic activity of a recombinant form of Glutaminase 1 (GAC) using a biochemical assay th...
In DepthDetails US Patent