BDBM108726 US8604016, 1038::US9938267, Cmpd ID 1038
SMILES O=C(Cc1ccccc1)Nc1ccc(CCCCc2ccc(NC(=O)Cc3ccccc3)nn2)nn1
InChI Key InChIKey=JFTRIYLDWXSBOI-UHFFFAOYSA-N
Data  4 IC50
  Tab Delimited (TSV)   2D SDfile   Computed 3D by Vconf -m prep SDfile
Find this compound or compounds like it in BindingDB:
Activity Spreadsheet -- Enzyme Inhibition Constant Data from BindingDB
Found 4 hits for monomerid = 108726
TargetGlutaminase kidney isoform, mitochondrial(Homo sapiens (Human))
Calithera Biosciences
US Patent
LigandPNGBDBM108726(US8604016, 1038 | US9938267, Cmpd ID 1038)
Affinity DataIC50:  80nM. Assay description: Compounds were assessed for their ability to inhibit the enzymatic activity of a recombinant form of Glutaminase 1 (GAC) using a biochemical assay th...
Ligand InfoPC cidPC sid
In DepthDetails US Patent
TargetGlutaminase kidney isoform, mitochondrial(Homo sapiens (Human))
Calithera Biosciences
US Patent
LigandPNGBDBM108726(US8604016, 1038 | US9938267, Cmpd ID 1038)
Affinity DataIC50:  80nM. Assay description: Inhibition of GAC (unknown origin)
Ligand InfoPC cidPC sid
In DepthDetails ArticlePubMed
TargetGlutaminase kidney isoform, mitochondrial(Homo sapiens (Human))
Calithera Biosciences
US Patent
LigandPNGBDBM108726(US8604016, 1038 | US9938267, Cmpd ID 1038)
Affinity DataIC50:  10nM. Assay description: Inhibition of GAC (unknown origin) assessed as NADH formation using 10 mM glutamine as substrate preincubated for 60 mins
Ligand InfoPC cidPC sid
In DepthDetails ArticlePubMed
TargetGlutaminase kidney isoform, mitochondrial(Homo sapiens (Human))
Calithera Biosciences
US Patent
LigandPNGBDBM108726(US8604016, 1038 | US9938267, Cmpd ID 1038)
Affinity DataIC50:  80nM. Assay description: No preinc (Column 4).
Ligand InfoPC cidPC sid
In DepthDetails US Patent