BDBM10892 3-(4-tert-Butylphenylcarboxamido)benzenesulfonamide::4-tert-butyl-N-(3-sulfamoylphenyl)benzamide::aromatic/heteroaromatic sulfonamide 26
SMILES CC(C)(C)c1ccc(cc1)C(=O)Nc1cccc(c1)S(N)(=O)=O
InChI Key InChIKey=UAJYCSUKECWQFQ-UHFFFAOYSA-N
Data  3 KI
  Tab Delimited (TSV)   2D SDfile   Computed 3D by Vconf -m prep SDfile
Find this compound or compounds like it in BindingDB:
Activity Spreadsheet -- Enzyme Inhibition Constant Data from BindingDB
Found 3 hits for monomerid = 10892
TargetCarbonic anhydrase 2(Homo sapiens (Human))
Kochi Medical School
LigandPNGBDBM10892(3-(4-tert-Butylphenylcarboxamido)benzenesulfonamid...)
Affinity DataKi:  210nM. Assay description: An Applied Photophysics stopped-flow instrument has been used for assaying the CA-catalyzed CO2 hydration activity. Phenol red has been used as indic...
In DepthDetails ArticlePubMed
TargetCARBONIC ANHYDRASE(Helicobacter pylori J99)
Kochi Medical School
LigandPNGBDBM10892(3-(4-tert-Butylphenylcarboxamido)benzenesulfonamid...)
Affinity DataKi:  316nM. Assay description: An Applied Photophysics stopped-flow instrument has been used for assaying the CA-catalyzed CO2 hydration activity. Phenol red has been used as indic...
In DepthDetails ArticlePubMed
TargetCarbonic anhydrase 1(Homo sapiens (Human))
Kochi Medical School
LigandPNGBDBM10892(3-(4-tert-Butylphenylcarboxamido)benzenesulfonamid...)
Affinity DataKi:  1.08E+4nM. Assay description: An Applied Photophysics stopped-flow instrument has been used for assaying the CA-catalyzed CO2 hydration activity. Phenol red has been used as indic...
In DepthDetails ArticlePubMed