BDBM109100 US8609852, 6
SMILES COc1ccc(F)cc1-c1ccc(cn1)C#Cc1csc(C)n1
InChI Key InChIKey=FHOVFKHGZUVLKC-UHFFFAOYSA-N
Data  1 KI
  Tab Delimited (TSV)   2D SDfile   Computed 3D by Vconf -m prep SDfile
Find this compound or compounds like it in BindingDB:
Activity Spreadsheet -- Enzyme Inhibition Constant Data from BindingDB
Found 1 hit for monomerid = 109100
TargetMetabotropic glutamate receptor 5(Rattus norvegicus (Rat))
Merck Sharp & Dohme
US Patent
LigandPNGBDBM109100(US8609852, 6)
Affinity DataKi:  1.20nM ΔG°:  -12.2kcal/moleT: 2°C. Assay description: Binding assays were performed as described in Schaffhauser H, Richards J G, Cartmell J, Chaboz S, Kemp J A, Klingelschmidt A, Messer J, Stadler H, Wo...
In DepthDetails US Patent