BDBM109211 CB29 (derivative 2)
SMILES CNS(=O)(=O)c1ccc(Nc2ccc(F)cc2)c(c1)[N+]([O-])=O
InChI Key InChIKey=PPADCYXTKPAXCS-UHFFFAOYSA-N
Data  1 IC50
  Tab Delimited (TSV)   2D SDfile   Computed 3D by Vconf -m prep SDfile
Find this compound or compounds like it in BindingDB:
Activity Spreadsheet -- Enzyme Inhibition Constant Data from BindingDB
Found 1 hit for monomerid = 109211
TargetAldehyde dehydrogenase, dimeric NADP-preferring(Homo sapiens (Human))
Indiana University
LigandPNGBDBM109211(CB29 (derivative 2))
Affinity DataIC50:  2.60E+4nM. Assay description: To determine the IC50 values for CB29 and its analogues, propionaldehyde was used as the substrate for ALDH1A1 and ALDH2 and benzaldehyde was used as...
In DepthDetails ArticlePubMed