BDBM109215 CB29 (derivative 5)
SMILES CN(C)c1ccc(Nc2ccc(cc2[N+]([O-])=O)S(=O)(=O)C(F)(F)F)cc1
InChI Key InChIKey=AYXOQXGUVHPODV-UHFFFAOYSA-N
Data  1 IC50
  Tab Delimited (TSV)   2D SDfile   Computed 3D by Vconf -m prep SDfile
Find this compound or compounds like it in BindingDB:
Activity Spreadsheet -- Enzyme Inhibition Constant Data from BindingDB
Found 1 hit for monomerid = 109215
TargetAldehyde dehydrogenase, dimeric NADP-preferring(Homo sapiens (Human))
Indiana University
LigandPNGBDBM109215(CB29 (derivative 5))
Affinity DataIC50:  1.70E+4nM. Assay description: To determine the IC50 values for CB29 and its analogues, propionaldehyde was used as the substrate for ALDH1A1 and ALDH2 and benzaldehyde was used as...
In DepthDetails ArticlePubMed