BDBM109233 2-(8-(2-(Benzothiazol-2-yl)hydrazono)-5,6,7,8-tetrahydronaphthalen-2-yl)thiazole-4-carboxylic acid (Compound 4)::CHEMBL2398260
SMILES OC(=O)c1csc(n1)-c1ccc2CCCC(=NNc3nc4ccccc4s3)c2c1
InChI Key InChIKey=VQBHQKNPDJBYMG-UHFFFAOYSA-N
Data  10 IC50
  Tab Delimited (TSV)   2D SDfile   Computed 3D by Vconf -m prep SDfile
Find this compound or compounds like it in BindingDB:
Activity Spreadsheet -- Enzyme Inhibition Constant Data from BindingDB
Found 10 hits for monomerid = 109233
TargetIsoform Bcl-X(L) of Bcl-2-like protein 1 (Bcl-xL)(Homo sapiens (Human))
Walter And Eliza Hall Institute Of Medical Research
LigandPNGBDBM109233(2-(8-(2-(Benzothiazol-2-yl)hydrazono)-5,6,7,8-tetr...)
Affinity DataIC50:  24nMpH: 7.4 T: 2°C. Assay description: Each 384-well plate was prepared with 4.75 µL of working assay buffer (50 mM HEPES, 10 mM DTT, 100 mM NaCl, 0.05% Tween029 and 0.1 mg/mL casein,...
In DepthDetails ArticlePubMed
TargetInduced myeloid leukemia cell differentiation protein Mcl-1(Homo sapiens (Human))
Walter And Eliza Hall Institute Of Medical Research
LigandPNGBDBM109233(2-(8-(2-(Benzothiazol-2-yl)hydrazono)-5,6,7,8-tetr...)
Affinity DataIC50:  4.00E+4nMpH: 7.4 T: 2°C. Assay description: Each 384-well plate was prepared with 4.75 µL of working assay buffer (50 mM HEPES, 10 mM DTT, 100 mM NaCl, 0.05% Tween029 and 0.1 mg/mL casein,...
In DepthDetails ArticlePubMed
TargetIsoform Bcl-X(L) of Bcl-2-like protein 1 (Bcl-xL)(Homo sapiens (Human))
Walter And Eliza Hall Institute Of Medical Research
LigandPNGBDBM109233(2-(8-(2-(Benzothiazol-2-yl)hydrazono)-5,6,7,8-tetr...)
Affinity DataIC50:  13nMpH: 7.4Assay Description:The protocols for tight and weak binders were described in Biacore S51 assay set-up with a flow rate of 30 µL/min. For His-Bcl-2 protein assays...
In DepthDetails ArticlePubMed
TargetApoptosis regulator Bcl-2(Homo sapiens (Human))
Walter And Eliza Hall Institute Of Medical Research
LigandPNGBDBM109233(2-(8-(2-(Benzothiazol-2-yl)hydrazono)-5,6,7,8-tetr...)
Affinity DataIC50:  2.00E+3nMpH: 7.4Assay Description:The protocols for tight and weak binders were described in Biacore S51 assay set-up with a flow rate of 30 µL/min. For His-Bcl-2 protein assays...
In DepthDetails ArticlePubMed
TargetBcl-2-like protein 1(Homo sapiens (Human))
The Walter And Eliza Hall Institute Of Medical Research
Curated by ChEMBL
LigandPNGBDBM109233(2-(8-(2-(Benzothiazol-2-yl)hydrazono)-5,6,7,8-tetr...)
Affinity DataIC50:  13nM. Assay description: Binding affinity to human GST-tagged Bcl-Xl by surface plasmon resonance assay
In DepthDetails ArticlePubMed
TargetInduced myeloid leukemia cell differentiation protein Mcl-1(Homo sapiens (Human))
Walter And Eliza Hall Institute Of Medical Research
LigandPNGBDBM109233(2-(8-(2-(Benzothiazol-2-yl)hydrazono)-5,6,7,8-tetr...)
Affinity DataIC50:  8.00E+3nMpH: 7.4Assay Description:The protocols for tight and weak binders were described in Biacore S51 assay set-up with a flow rate of 30 µL/min. For His-Bcl-2 protein assays...
In DepthDetails ArticlePubMed
TargetApoptosis regulator Bcl-2(Homo sapiens (Human))
Walter And Eliza Hall Institute Of Medical Research
LigandPNGBDBM109233(2-(8-(2-(Benzothiazol-2-yl)hydrazono)-5,6,7,8-tetr...)
Affinity DataIC50:  5.00E+3nM. Assay description: Binding affinity to Bcl-2 (unknown origin) by surface plasmon resonance assay
In DepthDetails ArticlePubMed
TargetBcl-2-like protein 2(Homo sapiens (Human))
The Walter And Eliza Hall Institute Of Medical Research
Curated by ChEMBL
LigandPNGBDBM109233(2-(8-(2-(Benzothiazol-2-yl)hydrazono)-5,6,7,8-tetr...)
Affinity DataIC50:  5.00E+3nM. Assay description: Binding affinity to Bcl-w (unknown origin) by surface plasmon resonance assay
In DepthDetails ArticlePubMed
TargetBcl-2-like protein 1(Homo sapiens (Human))
The Walter And Eliza Hall Institute Of Medical Research
Curated by ChEMBL
LigandPNGBDBM109233(2-(8-(2-(Benzothiazol-2-yl)hydrazono)-5,6,7,8-tetr...)
Affinity DataIC50:  24nM. Assay description: Binding affinity to human GST-tagged Bcl-Xl by luminescence proximity assay
In DepthDetails ArticlePubMed
TargetBcl-2-like protein 2(Homo sapiens (Human))
The Walter And Eliza Hall Institute Of Medical Research
Curated by ChEMBL
LigandPNGBDBM109233(2-(8-(2-(Benzothiazol-2-yl)hydrazono)-5,6,7,8-tetr...)
Affinity DataIC50:  5.30E+3nMpH: 7.4Assay Description:The protocols for tight and weak binders were described in Biacore S51 assay set-up with a flow rate of 30 µL/min. For His-Bcl-2 protein assays...
In DepthDetails ArticlePubMed