BDBM109235 (E)-2-(8-(2-(Benzo[d]thiazol-2-yl)hydrazono)-5,6,7,8-tetrahydronaphthalen-2-yl)-5-(4-phenylbutyl)thiazole-4-carboxylic acid (Compound 6)
SMILES OC(=O)c1nc(sc1CCCCc1ccccc1)-c1ccc2CCCC(=NNc3nc4ccccc4s3)c2c1
InChI Key InChIKey=KJRCRYVHSPWAIC-UHFFFAOYSA-N
Data  2 IC50
PDB links: 1 PDB ID matches this monomer.
  Tab Delimited (TSV)   2D SDfile   Computed 3D by Vconf -m prep SDfile
Find this compound or compounds like it in BindingDB:
Activity Spreadsheet -- Enzyme Inhibition Constant Data from BindingDB
Found 2 hits for monomerid = 109235
TargetInduced myeloid leukemia cell differentiation protein Mcl-1(Homo sapiens (Human))
Walter And Eliza Hall Institute Of Medical Research
LigandPNGBDBM109235((E)-2-(8-(2-(Benzo[d]thiazol-2-yl)hydrazono)-5,6,7...)
Affinity DataIC50:  3.80E+4nMpH: 7.4 T: 2°C. Assay description: Each 384-well plate was prepared with 4.75 µL of working assay buffer (50 mM HEPES, 10 mM DTT, 100 mM NaCl, 0.05% Tween029 and 0.1 mg/mL casein,...
In DepthDetails ArticlePubMed
TargetIsoform Bcl-X(L) of Bcl-2-like protein 1 (Bcl-xL)(Homo sapiens (Human))
Walter And Eliza Hall Institute Of Medical Research
LigandPNGBDBM109235((E)-2-(8-(2-(Benzo[d]thiazol-2-yl)hydrazono)-5,6,7...)
Affinity DataIC50:  1.5nMpH: 7.4 T: 2°C. Assay description: Each 384-well plate was prepared with 4.75 µL of working assay buffer (50 mM HEPES, 10 mM DTT, 100 mM NaCl, 0.05% Tween029 and 0.1 mg/mL casein,...
In DepthDetails ArticlePubMed