BDBM109469 US9695205, 21
SMILES CC(=O)c1cn(CC(=O)N2C[C@H](F)C[C@H]2C(=O)NCc2cccc(Cl)c2F)c2ccc(NC(=O)NCC(F)(F)F)cc12
InChI Key InChIKey=BQZPULPHCYFOSE-ZHRRBRCNSA-N
Data  1 IC50
  Tab Delimited (TSV)   2D SDfile   Computed 3D by Vconf -m prep SDfile
Find this compound or compounds like it in BindingDB:
Activity Spreadsheet -- Enzyme Inhibition Constant Data from BindingDB
Found 1 hit for monomerid = 109469
TargetComplement factor D(Homo sapiens (Human))
Achillion Pharmaceuticals
US Patent
LigandPNGBDBM109469(US9695205, 21)
Affinity DataIC50: <1.00E+3nMpH: 7.5 T: 2°C. Assay description: Human factor D (purified from human serum, Complement Technology, Inc.) at 80 nM final concentration is incubated with test compound at various conce...
In DepthDetails US Patent