BDBM109704 US8609715, B-61
SMILES Cc1cc(sc1CCC(=O)N[C@@H](CC(O)=O)C(O)=O)C(=O)Oc1ccc(cc1F)C(N)=N
InChI Key InChIKey=KUFWXCZSAUGMIW-LBPRGKRZSA-N
Data  2 KI
  Tab Delimited (TSV)   2D SDfile   Computed 3D by Vconf -m prep SDfile
Find this compound or compounds like it in BindingDB:
Activity Spreadsheet -- Enzyme Inhibition Constant Data from BindingDB
Found 2 hits for monomerid = 109704
TargetEnteropeptidase(Homo sapiens (Human))
Ajinomoto
US Patent
LigandPNGBDBM109704(US8609715, B-61)
Affinity DataKi:  0.130nM. Assay description: Inhibition assay using human enteropeptidase.
In DepthDetails US Patent
TargetSerine protease 1(Homo sapiens (Human))
Ajinomoto
US Patent
LigandPNGBDBM109704(US8609715, B-61)
Affinity DataKi:  0.5nM. Assay description: Inhibition assay using human trysin.
In DepthDetails US Patent