BDBM109982 US8609678, 2-(2,6-dimethylphenylamino)-N-(7-(hydroxyamino)-7-oxoheptyl)-N-methylpyrimidine-5-carboxamide [35]
SMILES CN(CCCCCCC(=O)NO)C(=O)c1cnc(Nc2c(C)cccc2C)nc1
InChI Key InChIKey=ZPAILHBULGHUTC-UHFFFAOYSA-N
Data  2 IC50
  Tab Delimited (TSV)   2D SDfile   Computed 3D by Vconf -m prep SDfile
Find this compound or compounds like it in BindingDB:
Activity Spreadsheet -- Enzyme Inhibition Constant Data from BindingDB
Found 2 hits for monomerid = 109982
TargetHistone deacetylase 6(Homo sapiens (Human))
Acetylon Pharmaceuticals
US Patent
LigandPNGBDBM109982(US8609678, 2-(2,6-dimethylphenylamino)-N-(7-(hydro...)
Affinity DataIC50:  387nMpH: 7.4Assay Description:Compounds for testing were diluted in DMSO to 50 fold the final concentration and a ten point three fold dilution series was made. The compounds were...
In DepthDetails US Patent
TargetHistone deacetylase 6(Homo sapiens (Human))
Acetylon Pharmaceuticals
US Patent
LigandPNGBDBM109982(US8609678, 2-(2,6-dimethylphenylamino)-N-(7-(hydro...)
Affinity DataIC50:  33nMpH: 7.4Assay Description:Compounds for testing were diluted in DMSO to 50 fold the final concentration and a ten point three fold dilution series was made. The compounds were...
In DepthDetails US Patent