BDBM110015 US8609678, 4-((2,6-dimethylphenyl)(pyrimidin-2-yl)amino)-N-(7-(hydroxyamino)-7-oxoheptyl)benzamide [68]
SMILES Cc1cccc(C)c1N(c1ccc(cc1)C(=O)NCCCCCCC(=O)NO)c1ncccn1
InChI Key InChIKey=LXNFZCUELNFNLI-UHFFFAOYSA-N
Data  2 IC50
  Tab Delimited (TSV)   2D SDfile   Computed 3D by Vconf -m prep SDfile
Find this compound or compounds like it in BindingDB:
Activity Spreadsheet -- Enzyme Inhibition Constant Data from BindingDB
Found 2 hits for monomerid = 110015
TargetHistone deacetylase 6(Homo sapiens (Human))
Acetylon Pharmaceuticals
US Patent
LigandPNGBDBM110015(US8609678, 4-((2,6-dimethylphenyl)(pyrimidin-2-yl)...)
Affinity DataIC50:  85nMpH: 7.4Assay Description:Compounds for testing were diluted in DMSO to 50 fold the final concentration and a ten point three fold dilution series was made. The compounds were...
In DepthDetails US Patent
TargetHistone deacetylase 6(Homo sapiens (Human))
Acetylon Pharmaceuticals
US Patent
LigandPNGBDBM110015(US8609678, 4-((2,6-dimethylphenyl)(pyrimidin-2-yl)...)
Affinity DataIC50:  4nMpH: 7.4Assay Description:Compounds for testing were diluted in DMSO to 50 fold the final concentration and a ten point three fold dilution series was made. The compounds were...
In DepthDetails US Patent