BDBM110156 (E)-8-[3-(Trifluoromethyl)styryl]-1,3,7-triethylxanthine (7f)
SMILES CCn1c(\C=C\c2cccc(c2)C(F)(F)F)nc2n(CC)c(=O)n(CC)c(=O)c12
InChI Key InChIKey=IOEQZXRUNRLNHK-ZHACJKMWSA-N
Data  1 KI
  Tab Delimited (TSV)   2D SDfile   Computed 3D by Vconf -m prep SDfile
Find this compound or compounds like it in BindingDB:
Activity Spreadsheet -- Enzyme Inhibition Constant Data from BindingDB
Found 1 hit for monomerid = 110156
TargetAdenosine receptor A2a(Rattus norvegicus (rat))
North-West University, Private Bag X6001, Potchefstroom 2520, South Africa
LigandPNGBDBM110156((E)-8-[3-(Trifluoromethyl)styryl]-1,3,7-triethylxa...)
Affinity DataKi: >1.00E+3nM
In DepthDetails ArticlePubMed