BDBM110226 US8618290, 78
SMILES COc1cccc(n1)-c1cc(F)ccc1[C@H]1Cc2nc(N)nc(C)c2C(NOCCCO)=N1
InChI Key InChIKey=ZPNUCOCBFHMOMV-GOSISDBHSA-N
Data  1 IC50
  Tab Delimited (TSV)   2D SDfile   Computed 3D by Vconf -m prep SDfile
Find this compound or compounds like it in BindingDB:
Activity Spreadsheet -- Enzyme Inhibition Constant Data from BindingDB
Found 1 hit for monomerid = 110226
TargetHeat shock protein HSP 90-alpha(Homo sapiens (Human))
Takeda Pharmaceutical
US Patent
LigandPNGBDBM110226(US8618290, 78)
Affinity DataIC50:  4nMpH: 7.3Assay Description:An in vitro competition fluorescence polarization assay in which a test compound competes with a fluorescent probe for binding to the binding domain ...
In DepthDetails US Patent