BDBM110357 US8613914, 125::US9206232, 129
SMILES CCN1CCC[C@H]1C(=O)N[C@@H](C1CCCCC1)C(=O)N[C@H](C(=O)N1C[C@]2(C[C@H]1C(=O)N[C@@]1(C[C@H]1C=C)C(=O)NS(=O)(=O)N1CCCC1)C(C)(C)C21CCC1)C1(C)CCOCC1
InChI Key InChIKey=YFRRVKROWLRIHD-LDFRYFKTSA-N
Data  2 IC50
  Tab Delimited (TSV)   2D SDfile   Computed 3D by Vconf -m prep SDfile
Find this compound or compounds like it in BindingDB:
Activity Spreadsheet -- Enzyme Inhibition Constant Data from BindingDB
Found 2 hits for monomerid = 110357
TargetGenome polyprotein(Hepatitis C virus (HCV genotype 1a, isolate H))
Novartis
US Patent
LigandPNGBDBM110357(US8613914, 125 | US9206232, 129)
Affinity DataIC50:  6nM. Assay description: The inhibitory activity of certain compounds of Table A against HCV NS3-4A serine protease is determined in a homogenous assay using the full-length ...
In DepthDetails US Patent
TargetGenome polyprotein(Hepatitis C virus)
Novartis
US Patent
LigandPNGBDBM110357(US8613914, 125 | US9206232, 129)
Affinity DataIC50: <0.300nM. Assay description: The inhibitory activity of certain compounds against HCV NS3-4A serine protease is determined in a homogenous assay using the full-length NS3-4A prot...
In DepthDetails US Patent