BDBM1106 (4R,5R,6R)-Tetrahydro-1,3-bis[(3-(N-hydroxycarboximidamide)-4-fluoro-phenyl)methyl]-5-hydroxy-4-(2-phenylethyl)-6-(phenylmethyl)-2(1H)-pyrimidinone::5-{[(4R,5R,6R)-4-benzyl-3-{[4-fluoro-3-(N'-hydroxycarbamimidoyl)phenyl]methyl}-5-hydroxy-2-oxo-6-(2-phenylethyl)-1,3-diazinan-1-yl]methyl}-2-fluoro-N'-hydroxybenzene-1-carboximidamide::Tetrahydropyrimidinone deriv. 63
SMILES ONC(=N)c1cc(CN2[C@H](CCc3ccccc3)[C@@H](O)[C@@H](Cc3ccccc3)N(Cc3ccc(F)c(c3)C(=N)NO)C2=O)ccc1F
InChI Key InChIKey=GVWYIVARRNFICI-XWHIBYANSA-N
Data  1 KI
  Tab Delimited (TSV)   2D SDfile   Computed 3D by Vconf -m prep SDfile
Find this compound or compounds like it in BindingDB:
Activity Spreadsheet -- Enzyme Inhibition Constant Data from BindingDB
Found 1 hit for monomerid = 1106
TargetDimer of Gag-Pol polyprotein [489-587](Human immunodeficiency virus type 1)
Dupont Pharmaceuticals
LigandPNGBDBM1106((4R,5R,6R)-Tetrahydro-1,3-bis[(3-(N-hydroxycarboxi...)
Affinity DataKi:  0.0600nM ΔG°:  -14.5kcal/molepH: 5.5 T: 2°C. Assay description: Inhibition of HIV protease was measured by assay of the cleavage of a fluorescent peptide substrate. The fluorescent product (2-aminobenzoyl-Ala-Thr-...
In DepthDetails ArticlePubMed