BDBM110604 US8614234, 72::US9725433, 72
SMILES COC(=O)CNC(=O)c1c[nH]c(c1)-c1cc(Oc2ccc(NC(=O)Nc3cccc(C)c3)c(F)c2)ccn1
InChI Key InChIKey=MNZPHNAANANIDS-UHFFFAOYSA-N
Data  2 IC50
  Tab Delimited (TSV)   2D SDfile   Computed 3D by Vconf -m prep SDfile
Find this compound or compounds like it in BindingDB:
Activity Spreadsheet -- Enzyme Inhibition Constant Data from BindingDB
Found 2 hits for monomerid = 110604
TargetVascular endothelial growth factor receptor 2(Homo sapiens (Human))
Allergan
US Patent
LigandPNGBDBM110604(US8614234, 72 | US9725433, 72)
Affinity DataIC50:  15nM. Assay description: Automated FLIPR (Fluorometric Imaging Plate Reader) technology was used to screen for inhibitors of VEGF induced increases in intracellular calcium l...
In DepthDetails US Patent
TargetVascular endothelial growth factor receptor 2(Homo sapiens (Human))
Allergan
US Patent
LigandPNGBDBM110604(US8614234, 72 | US9725433, 72)
Affinity DataIC50:  15nMpH: 7.2 T: 2°C. Assay description: Kinase assays were performed in 96 well microtiter plates that were coated overnight with 30.mu.g of poly-Glu-Tyr (4:1) in 10 mM Phosphate Buffered S...
In DepthDetails US Patent