BDBM110638 US8614234, 106::US9725433, 106
SMILES Cc1ccc(F)c(NC(=O)Nc2ccc(Oc3ccnc(c3)-c3cc(c[nH]3)C(=O)N3CC3)cc2)c1
InChI Key InChIKey=TUFYNKHKTQKMKK-UHFFFAOYSA-N
Data  2 IC50
  Tab Delimited (TSV)   2D SDfile   Computed 3D by Vconf -m prep SDfile
Find this compound or compounds like it in BindingDB:
Activity Spreadsheet -- Enzyme Inhibition Constant Data from BindingDB
Found 2 hits for monomerid = 110638
TargetVascular endothelial growth factor receptor 2(Homo sapiens (Human))
Allergan
US Patent
LigandPNGBDBM110638(US8614234, 106 | US9725433, 106)
Affinity DataIC50:  21nM. Assay description: Automated FLIPR (Fluorometric Imaging Plate Reader) technology was used to screen for inhibitors of VEGF induced increases in intracellular calcium l...
In DepthDetails US Patent
TargetVascular endothelial growth factor receptor 2(Homo sapiens (Human))
Allergan
US Patent
LigandPNGBDBM110638(US8614234, 106 | US9725433, 106)
Affinity DataIC50:  21nMpH: 7.2 T: 2°C. Assay description: Kinase assays were performed in 96 well microtiter plates that were coated overnight with 30.mu.g of poly-Glu-Tyr (4:1) in 10 mM Phosphate Buffered S...
In DepthDetails US Patent