BDBM110653 US8614234, 121::US9725433, 121
SMILES OC(=O)c1c[nH]c(c1)-c1cc(Oc2ccc(NC(=O)Nc3ccc(Cl)c(c3)C(F)(F)F)cc2)ccn1
InChI Key InChIKey=QLJWNTHEJPFKDE-UHFFFAOYSA-N
Data  4 IC50
  Tab Delimited (TSV)   2D SDfile   Computed 3D by Vconf -m prep SDfile
Find this compound or compounds like it in BindingDB:
Activity Spreadsheet -- Enzyme Inhibition Constant Data from BindingDB
Found 4 hits for monomerid = 110653
TargetVascular endothelial growth factor receptor 2(Homo sapiens (Human))
Allergan
US Patent
LigandPNGBDBM110653(US8614234, 121 | US9725433, 121)
Affinity DataIC50:  14nMpH: 7.2 T: 2°C. Assay description: Kinase assays were performed in 96 well microtiter plates that were coated overnight with 30.mu.g of poly-Glu-Tyr (4:1) in 10 mM Phosphate Buffered S...
In DepthDetails US Patent
TargetVascular endothelial growth factor receptor 1(Homo sapiens (Human))
Allergan
US Patent
LigandPNGBDBM110653(US8614234, 121 | US9725433, 121)
Affinity DataIC50:  20nM. Assay description: The cytoplasmic domain of the human VEGF receptor (VEGFR-2) was expressed as a Histidine-tagged fusion protein following infection of insect cells us...
In DepthDetails US Patent
TargetVascular endothelial growth factor receptor 2(Homo sapiens (Human))
Allergan
US Patent
LigandPNGBDBM110653(US8614234, 121 | US9725433, 121)
Affinity DataIC50:  14nM. Assay description: Automated FLIPR (Fluorometric Imaging Plate Reader) technology was used to screen for inhibitors of VEGF induced increases in intracellular calcium l...
In DepthDetails US Patent
TargetVascular endothelial growth factor receptor 1(Homo sapiens (Human))
Allergan
US Patent
LigandPNGBDBM110653(US8614234, 121 | US9725433, 121)
Affinity DataIC50:  20nMpH: 7.2 T: 2°C. Assay description: Kinase assays were performed in 96 well microtiter plates that were coated overnight with 30.mu.g of poly-Glu-Tyr (4:1) in 10 mM Phosphate Buffered S...
In DepthDetails US Patent