BDBM11078 (2S)-1-{[(2S,5R)-5-(4-bromophenoxymethyl)pyrrolidin-2-yl]carbonyl}pyrrolidine-2-carbonitrile::2-cyanopyrrolidine 21b
SMILES Brc1ccc(OC[C@H]2CC[C@H](N2)C(=O)N2CCC[C@H]2C#N)cc1
InChI Key InChIKey=BRFXLEJAFZZUFW-YCPHGPKFSA-N
Data  1 KI
  Tab Delimited (TSV)   2D SDfile   Computed 3D by Vconf -m prep SDfile
Find this compound or compounds like it in BindingDB:
Activity Spreadsheet -- Enzyme Inhibition Constant Data from BindingDB
Found 1 hit for monomerid = 11078
TargetDipeptidyl peptidase 4(Homo sapiens (Human))
Abbott Laboratories
LigandPNGBDBM11078((2S)-1-{[(2S,5R)-5-(4-bromophenoxymethyl)pyrrolidi...)
Affinity DataKi:  4.60nM. Assay description: The DPP4 activity resulted in the formation of the fluorescent product amidomethylcoumarin (AMC), which was monitored by excitation at 355 nm and mea...
In DepthDetails ArticlePubMed