BDBM110982 US8614253, 3-13::US9241942, 3-13::US9963434, Compound 3-13
SMILES COc1cc(cc(C=O)c1O)-c1ccc2OCOc2c1
InChI Key InChIKey=LLNBSICRHFTRDT-UHFFFAOYSA-N
Data  3 IC50
  Tab Delimited (TSV)   2D SDfile   Computed 3D by Vconf -m prep SDfile
Find this compound or compounds like it in BindingDB:
Activity Spreadsheet -- Enzyme Inhibition Constant Data from BindingDB
Found 3 hits for monomerid = 110982
TargetSerine/threonine-protein kinase/endoribonuclease IRE1(Homo sapiens (Human))
Mannkind
US Patent
LigandPNGBDBM110982(US8614253, 3-13 | US9241942, 3-13 | US9963434, Com...)
Affinity DataIC50:  250nMpH: 7.5 T: 2°C. Assay description: IRE-1 alpha, T1 RNase, and RNase A assays carried out in vitro with several o-vanillin derivatives to demonstrate selectivity of the derivatives for ...
In DepthDetails US Patent
TargetSerine/threonine-protein kinase/endoribonuclease IRE1(Homo sapiens (Human))
Mannkind
US Patent
LigandPNGBDBM110982(US8614253, 3-13 | US9241942, 3-13 | US9963434, Com...)
Affinity DataIC50:  250nM. Assay description: A fusion protein comprising glutathione S transferase (GST) and human IRE-1α (GST-IRE-1α) was obtained from a 500 ml baculovirus-infected i...
In DepthDetails US Patent
TargetSerine/threonine-protein kinase/endoribonuclease IRE1(Homo sapiens (Human))
Mannkind
US Patent
LigandPNGBDBM110982(US8614253, 3-13 | US9241942, 3-13 | US9963434, Com...)
Affinity DataIC50:  250nMpH: 7.5Assay Description:A fusion protein comprising glutathione S transferase (GST) and human IRE-1α (GST-IRE-1α) was obtained from a 500 ml baculovirus-infected i...
In DepthDetails US Patent