BDBM110993 US8614253, 3-24::US8614253, 43-2::US9241942, 3-24::US9963434, Compound 3-24
SMILES COc1cc(cc(C=O)c1O)-c1ccc2OCCc2c1
InChI Key InChIKey=QPACVKDAIWVNGH-UHFFFAOYSA-N
Data  5 IC50  1 EC50
  Tab Delimited (TSV)   2D SDfile   Computed 3D by Vconf -m prep SDfile
Find this compound or compounds like it in BindingDB:
Activity Spreadsheet -- Enzyme Inhibition Constant Data from BindingDB
Found 6 hits for monomerid = 110993
TargetSerine/threonine-protein kinase/endoribonuclease IRE1(Homo sapiens (Human))
Mannkind
US Patent
LigandPNGBDBM110993(US8614253, 3-24 | US8614253, 43-2 | US9241942, 3-2...)
Affinity DataIC50:  410nMpH: 7.5 T: 2°C. Assay description: IRE-1 alpha, T1 RNase, and RNase A assays carried out in vitro with several o-vanillin derivatives to demonstrate selectivity of the derivatives for ...
In DepthDetails US Patent
TargetSerine/threonine-protein kinase/endoribonuclease IRE1(Homo sapiens (Human))
Mannkind
US Patent
LigandPNGBDBM110993(US8614253, 3-24 | US8614253, 43-2 | US9241942, 3-2...)
Affinity DataIC50:  143nMpH: 7.5 T: 2°C. Assay description: IRE-1 alpha, T1 RNase, and RNase A assays carried out in vitro with several o-vanillin derivatives to demonstrate selectivity of the derivatives for ...
In DepthDetails US Patent
TargetSerine/threonine-protein kinase/endoribonuclease IRE1(Homo sapiens (Human))
Mannkind
US Patent
LigandPNGBDBM110993(US8614253, 3-24 | US8614253, 43-2 | US9241942, 3-2...)
Affinity DataIC50:  410nM. Assay description: A fusion protein comprising glutathione S transferase (GST) and human IRE-1α (GST-IRE-1α) was obtained from a 500 ml baculovirus-infected i...
In DepthDetails US Patent
TargetSerine/threonine-protein kinase/endoribonuclease IRE1(Homo sapiens (Human))
Mannkind
US Patent
LigandPNGBDBM110993(US8614253, 3-24 | US8614253, 43-2 | US9241942, 3-2...)
Affinity DataIC50:  143nMpH: 7.5Assay Description:A fusion protein comprising glutathione S transferase (GST) and human IRE-1α (GST-IRE-1α) was obtained from a 500 ml baculovirus-infected i...
In DepthDetails US Patent
TargetSerine/threonine-protein kinase/endoribonuclease IRE1(Homo sapiens (Human))
Mannkind
US Patent
LigandPNGBDBM110993(US8614253, 3-24 | US8614253, 43-2 | US9241942, 3-2...)
Affinity DataEC50:  8.00E+4nM. Assay description: Initial cell-based XBP-1 mRNA splicing assays confirmed IRE-1α inhibition with several potent 5-bromo and 6 bromo o-vanillins. HEK293 cells were...
In DepthDetails US Patent
TargetSerine/threonine-protein kinase/endoribonuclease IRE1(Homo sapiens (Human))
Mannkind
US Patent
LigandPNGBDBM110993(US8614253, 3-24 | US8614253, 43-2 | US9241942, 3-2...)
Affinity DataIC50:  410nMpH: 7.5Assay Description:A fusion protein comprising glutathione S transferase (GST) and human IRE-1α (GST-IRE-1α) was obtained from a 500 ml baculovirus-infected i...
In DepthDetails US Patent