BDBM111107 US9682910, 4-(3,5-dimethoxyphenethyl)benzene-1,3-diol (18)
SMILES COc1cc(CCc2ccc(O)cc2O)cc(OC)c1
InChI Key InChIKey=WLGDODVMYPYNOR-UHFFFAOYSA-N
Data  1 IC50
  Tab Delimited (TSV)   2D SDfile   Computed 3D by Vconf -m prep SDfile
Find this compound or compounds like it in BindingDB:
Activity Spreadsheet -- Enzyme Inhibition Constant Data from BindingDB
Found 1 hit for monomerid = 111107
TargetCell surface glycoprotein MUC18(Mouse)
Unigen
US Patent
LigandPNGBDBM111107(US9682910, 4-(3,5-dimethoxyphenethyl)benzene-1,3-d...)
Affinity DataIC50:  2.80E+3nMT: 2°C. Assay description: All test compounds were initially dissolved in 100% DMSO at a concentration of 400 mM. The compounds were further diluted in 100% DMSO to a concentra...
Ligand InfoPC cidPC sid
In DepthDetails US Patent