BDBM111114 US9682910, 4-(2-(tetrahydrofuran-2-yl)ethyl)benzene-1,3-diol (25)
SMILES Oc1ccc(CCC2CCCO2)c(O)c1
InChI Key InChIKey=ZPVBFAGBDKHSFS-UHFFFAOYSA-N
Data  1 IC50
  Tab Delimited (TSV)   2D SDfile   Computed 3D by Vconf -m prep SDfile
Find this compound or compounds like it in BindingDB:
Activity Spreadsheet -- Enzyme Inhibition Constant Data from BindingDB
Found 1 hit for monomerid = 111114
TargetCell surface glycoprotein MUC18(Mouse)
Unigen
US Patent
LigandPNGBDBM111114(US9682910, 4-(2-(tetrahydrofuran-2-yl)ethyl)benzen...)
Affinity DataIC50:  4.50E+3nMT: 2°C. Assay description: All test compounds were initially dissolved in 100% DMSO at a concentration of 400 mM. The compounds were further diluted in 100% DMSO to a concentra...
Ligand InfoPC cidPC sid
In DepthDetails US Patent