BDBM111163 US10556908, Example 15::US9695180, 15
SMILES CN(C)CCCN(C)c1nc(-c2ccc(cc2)C#N)c(-c2ccc(C)cc2)n2ccnc12
InChI Key InChIKey=IFDCCBWMSCGAPG-UHFFFAOYSA-N
Data  2 IC50
  Tab Delimited (TSV)   2D SDfile   Computed 3D by Vconf -m prep SDfile
Find this compound or compounds like it in BindingDB:
Activity Spreadsheet -- Enzyme Inhibition Constant Data from BindingDB
Found 2 hits for monomerid = 111163
TargetLysine-specific histone demethylase 1A(Homo sapiens (Human))
Incyte
US Patent
LigandPNGBDBM111163(US10556908, Example 15 | US9695180, 15)
Affinity DataIC50:  275nM. Assay description: LANCE LSD1/KDM1A demethylase assay 10 μL of 1 nM LSD-1 enzyme (ENZO BML-SE544-0050) in the assay buffer (50 mM Tris, pH 7.5, 0.01% Tween-20, 25 ...
Ligand InfoPC cidPC sid
In DepthDetails US Patent
TargetLysine-specific histone demethylase 1A [151-852](Homo sapiens (Human))
Incyte
US Patent
LigandPNGBDBM111163(US10556908, Example 15 | US9695180, 15)
Affinity DataIC50:  275nMpH: 7.5 T: 2°C. Assay description: 10 μL of 1 nM LSD-1 enzyme (ENZO BML-SE544-0050) in the assay buffer (50 mM Tris, pH 7.5, 0.01% Tween-20, 25 mM NaCl, 5 mM DTT) were preincubated ...
Ligand InfoPC cidPC sid
In DepthDetails US Patent