BDBM111182 US10112950, Example 34::US10556908, Example 34::US9695180, 34
SMILES Cc1ccc(cc1)-c1c(nc(OC[C@@H]2CCNC2)c2nc(cn12)C(F)(F)F)-c1ccc(cc1)C#N
InChI Key InChIKey=JLMIXWYNLSVTBL-GOSISDBHSA-N
Data  3 IC50
  Tab Delimited (TSV)   2D SDfile   Computed 3D by Vconf -m prep SDfile
Find this compound or compounds like it in BindingDB:
Activity Spreadsheet -- Enzyme Inhibition Constant Data from BindingDB
Found 3 hits for monomerid = 111182
TargetLysine-specific histone demethylase 1A [151-852](Homo sapiens (Human))
Incyte
US Patent
LigandPNGBDBM111182(US10112950, Example 34 | US10556908, Example 34 | ...)
Affinity DataIC50:  275nMpH: 7.5 T: 2°C. Assay description: 10 μL of 1 nM LSD-1 enzyme (ENZO BML-SE544-0050) in the assay buffer (50 mM Tris, pH 7.5, 0.01% Tween-20, 25 mM NaCl, 5 mM DTT) were preincubated ...
Ligand InfoPC cidPC sid
In DepthDetails US Patent
TargetLysine-specific histone demethylase 1A(Homo sapiens (Human))
Incyte
US Patent
LigandPNGBDBM111182(US10112950, Example 34 | US10556908, Example 34 | ...)
Affinity DataIC50:  275nM. Assay description: LANCE LSD1/KDM1A demethylase assay 10 μL of 1 nM LSD-1 enzyme (ENZO BML-SE544-0050) in the assay buffer (50 mM Tris, pH 7.5, 0.01% Tween-20, 25 ...
Ligand InfoPC cidPC sid
In DepthDetails US Patent
TargetLysine-specific histone demethylase 1A(Homo sapiens (Human))
Incyte
US Patent
LigandPNGBDBM111182(US10112950, Example 34 | US10556908, Example 34 | ...)
Affinity DataIC50:  275nMpH: 7.5Assay Description:LANCE LSD1/KDM1A demethylase assay-10 μL of 1 nM LSD-1 enzyme (ENZO BML-SE544-0050) in the assay buffer (50 mM Tris, pH 7.5, 0.01% Tween-20, 25 ...
Ligand InfoPC cidPC sid
In DepthDetails US Patent